,Total,DS 15 Miler,Colonial Half,Scholarship 5K,Strider Mile,DOG 5K,Logy Bear 8K,Swamp 5 Miler,XC Classic,Queens Lake 5K,Riverwatch 5K,Yorktown 10 Miler,Sleighbell 5K
Overall Men,,,,,,,,,,,,,
Dale Abrahamson,0,,,,,,,,,23:33,23:05,1:22:14,
Ken Alberg,0,,,,,,,,25:14,,,,
David Anderson,10,,1:43:38,,,20:11,,,10 - 21:22,19:16,,1:11:22,21:01
Larry Arata,0,,,,,30:19,1:04:20,,,,,,31:42
J. Robert Azaltovic III,,,,,,,,,,,,,
Gene Bachman,0,,,,,,,,,,,2:00:22,
Guy Beaver,,,,,,,,,,,,,
Leif Berner,0,,1:46:55,,,,,,,,,1:22:43,
Jimmy Blount,0,,,,,26:52,45:31,,,26:36,25:58,1:29:11,27:00
Christopher Brown,,,,,,,,,,,,,
Jess Brown,0,2:29:01,2:03:31,25:54,8:07.3,24:47,42:17,41:01,34:25,30:46,25:18,1:24:07,26:04
Bob Brunner,0,2:22:12,1:52:17,23:15,6:44.3,23:05,40:04,38:03,24:37,23:55,23:08,,
Joe Buck,0,2:29:20,2:18:57,27:48,7:32.8,27:06,48:05,45:39,28:21,25:59,25:36,1:35:10,26:24
Andrea Buoso,35,10 - 1:46:52,1:32:28,,,,33:36,10 - 32:09,15 - 20:41,19:52,19:23,1:08:53,
Richard Bush,0,,,,,,,,33:34,,,,
Joe Calkins,0,,1:35:19,,,19:46,,,,,,,
Kyle Carlson,0,2:00:45,,,,,,,,,,,
Jim Case,,,,,,,,,,,,,
Chris Catoe,,,,,,,,,,,,,
Stephen Chantry,0,,,,,18:58,,,,20:15,,,20:08
Brian Chiles,0,,2:43:45,39:42,12:16.6,35:22,54:14,53:16,34:20,43:07,34:51,1:47:52,31:00
John Chiles,0,,1:54:02,22:30,6:28.3,22:56,40:53,39:29,24:06,22:56,,,27:46
Magnus Chiles,0,,2:43:43,39:38,8:33.2,33:10,55:06,52:31,34:17,29:31,31:03,1:47:47,27:46
Evan Clary,59,,,12 - 18:10,,,12 - 30:46,,,8 - 17:37,,15 - 1:02:30,12 - 18:06
Cameron Cruse,,,,,,,,,,,,,
Daniel Cunnane,0,,,28:38,,,,47:13,,,,,
Robert Curtin,0,,,48:10,,48:21,1:20:29,,,47:13,44:11,,48:20
Michael Daly,0,,,,,29:39,,,,,,1:53:40,29:21
Greg Dawson,0,,,,,20:10,34:01,,,,,1:07:47,19:37
Joe Day,0,,,,,,,,,,,1:36:28,
John DiCarlo,0,2:29:20,,24:32,7:10.8,,43:02,46:16,,26:37,24:33,1:27:26,25:35
Michael Dixon,,,,,,,,,,,,,
Ryan Doupe,10,,10 - 1:24:25,,,,,,,,,,
Jim Duffy,0,2:05:23,1:46:16,,6:37.4,,38:34,37:08,,22:07,,1:16:39,22:07
Matthew Franco,,,,,,,,,,,,,
Scott Fredrick,,,,,,,,,,,,,
Jamie Garrett,,,,,,,,,,,,,
Pete Gibson,,,,,,,,,,,,,
David Glass,0,,,,,24:03,42:01,,,23:35,,1:26:20,24:25
Glenn Glass,18,,,,,10 - 18:10,33:24,,,18:30,,1:09:14,8 - 18:45
Paul Glass,8,,,,,,,,,,,8 - 1:05:54,19:07
Richard Grant,8,1:57:25,1:38:07,21:01,6:27.5,21:15,36:49,34:55,8 - 22:23,,,1:13:29,
Jim Gullo,0,,,25:28,7:14.3,24:57,42:46,39:45,25:44,23:54,24:00,1:32:58,24:40
Marquis Harden,,,,,,,,,,,,,
Bill Hart,,,,,,,,,,,,,
Randy Hawthorne,0,,,28:43,8:38.5,28:19,53:10,45:51,29:21,27:08,28:20,1:42:50,28:48
Tony Heimer,0,2:22:50,2:07:24,27:35,7:20.3,24:46,42:41,39:19,26:31,23:38,23:48,1:23:30,24:32
Thomas Hicks,44,20 - 1:43:08,,,,,,,,,12 - 18:00,12 - 1:04:09,
Richard Hildreth,0,,,,,,,54:19,36:12,,,,
Timothy Hodge,0,,,,,23:12,42:31,39:38,27:41,24:39,,,
Chris Holm,,,,,,,,,,,,,
Roger Hopper,100 (155),,,20 - 16:09,20 - 4:42.5,20 - 15:44,20 - 27:07,,,20 - 15:45,20 - 15:44,20 - 53:37,15 - 16:03
Charles Inman,12,12 - 1:46:50,,20:47,,,,,,,,,
Robert Jean,0,,,25:38,,23:54,42:06,,,25:17,24:48,1:29:53,24:30
Dwight Kane,0,,,,,40:11,,1:07:30,,,,,
Benjamin Kaurich,0,,1:41:01,,,23:04,40:28,,,22:30,,,23:29
Ken Kieft,0,,,,,,,36:48,23:26,,,,
George Knierbein,0,,,,,,,45:57,,,,,
Seth Kolosso,15, ,15 - 1:14:43,,,,,,,,,,
Isaac Lamprecht,0,,,,,18:56,33:57,,,18:18,,,
Chris Laws,0,,1:29:15,,,,,,,19:13,,,
Braxton Lee,0,,,38:01,,28:48,51:30,46:51,31:31,27:39,26:26,1:47:37,27:31
Bryton Lee,0,,,35:57,,29:49,1:07:04,1:01:38,30:47,36:18,30:53,,31:38
Jon Leiding,27,15 - 1:46:00,,20:56,10 - 6:06.1,20:29,34:01,36:15,12 - 21:08,19:59,20:19,,20:21
Frank Leone,0,,,,,,,,,,,1:07:13,
David Lockard,0,,1:36:58,,,,,,,,,,
Greg Lynn,41,,1:29:40,8 - 18:51,,8 - 18:19,32:19,15 - 30:42,,18:44,10 - 18:24,1:06:29,19:07
John Markley,0,,,,,,,1:00:31,,35:05,34:45,,35:24
James Martin,0,2:34:06,,27:11,,,,42:44,28:46,,,,
Stacin Martin,0,,,,,,,,,,,,
Andrew Medvec,,,,,,,,,,,,,
Peter Mercredi,0,2:05:30,,,,,,,,,,,
Drew Midland,27,,12 - 1:15:10,,15 - 4:45.7,,,,,,,,
Jason Miller,43,,8 - 1:27:30,,,15 - 18:08,33:22,20 - 29:56,,,,,
William Murray,0,,,,,,,,,22:16,,,23:05
Grant Neely,,,,,,,,,,,,,
George Nelsen,,,,,,,,,,,,,
Dan Neuland,,,,,,,,,,,,,
Frank Nixon,0,2:17:22,,25:13,6:47.7,,,42:59,,25:11,23:57,1:28:55,24:52
Chris Novakoski,62,1:50:15,,19:41,12 - 5:35.9,19:01,8 - 31:48,12 - 31:00,20 - 20:13,19:32,,10 - 1:04:22,19:46
Vincent Ortiz,,,,,,,,,,,,,
Adam Otstot,32,,,,,,,,,12 - 15:54,,,20 - 15:57
Chad Parker,,,,,,,,,,,,,
Paul Pelletier,8,,1:30:33,,,19:07,34:36,8 - 33:01,,,19:36,1:07:27,19:45
Steven Peters,0,,,36:35,,28:53,,,,,28:53,,
Richard Pidgeon,,,,,,,,,,,,,
John Piggott,,,,,,,,,,,,,
Rick Platt,0,,2:10:37,,,41:49,44:39,,,24:47,25:46,1:28:59,25:06
Bill Price,0,,1:52:20,27:12,7:33.6,,44:23,40:49,26:07,23:49,23:40,1:26:56,
John Price,0,,,,9:02.2,,,45:58,30:40,,,1:39:40,
Randy Proctor,,,,,,,,,,,,,
Kevin Rafferty,8,,,,8 - 6:17.8,,,35:36,22:59,21:27,,1:15:19,
Tom Randolph,0,2:08:58,,,,,,,,,,,
Robert Rantanen,0,,,27:35,,,,43:16,28:03,,,,
Andy Riley,35,,,,,,32:01,,,10 - 17:31,15 - 17:44,,10 - 18:09
Brett Riley,8,8 - 1:48:40,,,,,,,,,,,
Tim Robinson,,,,,,,,,,,,,
Ernest Schillinger,,,,,,,,,,,,,
Stephen Scudder,0,,,44:05,,41:36,,1:04:58,,,,,39:46
John Searing,0,,,31:23,,,,,,,,,
Steven Shapiro,0,,,,11:51.8,,1:03:42,1:00:49,,,,,
Ed Sharp,,,,,,,,,,,,,
Brook Sherman,0,2:14:26,,,,,,,,,,,
Lorenzo Short,0,,,,,,,,,18:33,19:07,1:08:57,19:03
Steven Short,0,,,,,,36:04,,,20:37,20:27,,21:22
Steve Speirs,,,,,,,,,,,,,
Logan St. John,10,,,10 - 18:18,,,,,,,,,
Michael Stallings,0,,,,,,,,23:36,,,,
Dwight Starks,0,,2:25:38,28:47,7:18.8,,,44:51,28:13,26:22,,1:45:23,26:49
Dean Stover,0,2:08:40,,22:30,,,,,24:51,,,,
William Thompson,50,,20 - 1:12:15,,,,15 - 27:23,,,15 - 15:50,,,
Jonathan Torres,30,,1:28:55,,,12 - 18:10,10 - 30:53,,,17:48,8 - 18:30,1:08:29,18:57
Winston Trice,0,,1:55:35,,,,38:38,,,,22:12,1:17:04,
Alan Van Zandt,0,2:04:42,1:47:47,,,21:44,36:25,,,22:27,,1:22:12,
Joseph Verdirame,0,,,26:17,7:30.7,,43:39,44:06,27:39,31:04,27:11,1:32:06,
John Walker,15,,,15 - 16:21,,,,,,,,,
Scott Ward,,,,,,,,,,,,,
Rick Webb,,,,,,,,,,,,,
Gregg Weber,0,,2:02:34,,7:02.9,,,40:05,,,,1:26:17,
Tim Westfall,0,,,25:16,,,,,25:47,,,1:21:00,
Dean Wewetzer,,,,,,,,,,,,,
Robert Whitaker,0,,,,,,,,,20:04,19:33,1:09:00,19:45
David Whitted,,,,,,,,,,,,,
John Wills,0,2:20:35,,,,,,,25:41,,,,
Sam Wittenberg,,,,,,,,,,,,,
John Yager,,,,,,,,,,,,,
Matthew Zentz,0,,1:55:58,28:54,6:49.2,26:25,46:23,43:02,26:45,25:12,24:38,1:28:48,25:25
,,,,,,,,,,,,,
Overall Women,,,,,,,,,,,,,
Jessica Anderson,28,,,,,10 - 26:00,,,10 - 25:46,8 - 23:43,,1:34:09,25:15
Lisa Armistead,,,,,,,,,,,,,
Danielle Arristide,,,,,,,,,,,,,
Susan Ashley,,,,,,,,,,,,,
Nancy Atlee,0,,,,,43:19,,,,,42:51,,45:57
Barbara Biasi,0,,,,,,,,,,31:02,,
Gail Biermann,0,2:32:53,2:18:30,29:58,,,,,,,,1:45:21,
Samantha Bradley,,,,,,,,,,,,,
Betty Brothers,0,,,26:21,7:35.4,,,41:55,28:48,,,,
Jamie Callahan-Brill,0,2:25:28,,,,,,,,,,,
Kallen Carlson,,,,,,,,,,,,,
Kristi Chiles,30,2:23:32,8 - 2:03:05,26:28,7:46.1,12 - 25:45,10 - 45:11,43:50,30:52,29:33,28:39,1:48:01,27:19
Tammi Clarke,0,2:24:53,,,,,,,,,26:34,,
Carla Cline,0,,,29:02,,,,,,,,1:41:41,
Amanda Collier,0,2:45:50,2:13:25,,,27:35,,,,,,1:38:30,
Jennifer Cornette,0,,,25:43,,,,,27:59,,,1:28:57,
Susan Davis,0,,,,,,,47:29,,,,1:42:27,
Virginia Davis,0,,,,,32:46,53:13,,34:25,30:45,31:12,1:51:39,32:38
Nancy Delaney,,,,,,,,,,,,,
Megan Doty,35,15 - 1:56:25,20 - 1:38:44,,,,,,,,,,
Victoria Estes,0,,,52:28,14:02.6,,1:17:00,1:14:30,,45:03,43:38,,46:47
Thea Ganoe,0,3:00:14,,,,,,,,,,,
Erin Gedicke,0,,,,,28:56,,,,,,1:40:44,
Tiffany Griffin,,,,,,,,,,,,,
Martha Gullo,0,,,37:35,9:48.4,33:09,54:46,50:44,34:21,30:45,31:53,1:52:06,31:34
Susan Hagel,48 (56),2:17:08,2:09:31,25:04,12 - 6:56.9,,12 - 42:36,8 - 40:21,8 - 27:14,25:06, 8 - 24:20,8 - 1:26:10,24:52
Kimberly Hague,0,,,,,,,44:55,,,,,
Catherine Harden,0,3:26:08,3:08:16,,,,,,,,,,
Karla Havens,,,,,,,,,,,,,
Julie Hicks,69 (115),10 - 2:08:51,,12 - 22:36,15 - 6:17.4,,,12 - 34:50,15 - 22:55,15 - 21:01,12 - 21:13,12 - 1:14:07,12 - 21:36
Emily Honeycutt,55,,,,,,20 - 34:57,,,20 - 20:41,, ,15 - 20:36
Dottie Humphreys,,,,,,,,,,,,,
Christie Ireland,0,,,,,,,1:02:01,,,38:19,,
Cannon Jean,65 (73),,,8 - 23:57,,15 - 23:30,15 - 41:38,,,12 - 21:39,15 - 21:12,1:26:57,8 - 22:49
Criztina Jean,0,,,34:07,,31:13,53:01,,,29:57,29:45,1:46:35,30:48
Sorenna Jean,50,,,15 - 21:25,,,,,,,,15 - 1:11:38,20 - 20:28
Kerry Johnson,37,12 - 1:59:02,15 - 1:43:41,,,,,10 - 37:00,,,,,
Valor Foy Jones,0,,2:04:36,,,,,,,,,,
Kirsten Kelly,54 (62),8 - 2:12:36,12 - 1:51:33,10 - 23:44,10 - 6:59.9,,,,12 - 25:18,,,10 - 1:21:51,
Deb Kopecky,,,,,,,,,,,,,
Susan Kreider,10,2:42:50,10 - 2:01:17,26:19,,,,,,,,,
Ruth Lamprecht,,,,,,,,,,,,,
Maryanne Lee,0,,,,,29:48,50:22,49:55,32:01,29:29,29:19,1:47:08,30:23
Stephanie Manny,,,,,,,,,,,,,
Teresa Markley,0,,,,,,,1:00:09,,34:38,33:49,,36:01
Barbara Mathewson,,,,,,,,,,,,,
Bunny May,P,,,53:13,13:38.1,,1:21:12,1:18:07,,45:48,45:01,,50:21
Renee Merchant,40,20 - 1:46:28,,,,,,20 - 32:48,,,,,
Michelle Moore,0,2:19:30,,,,,,,,,,,
Jenny Moran,100 (135),,,20 - 20:21,20 - 6:01.0,20 - 19:54,,15 - 33:02,20 - 21:19,,20 - 19:14,20 - 1:06:26,
Rachel Novakoski,0,2:35:57,,30:07,7:41.3,28:19,49:37,45:01,29:34,26:40,,,
Daphne Papaefthimiou,0,,,,,,47:44,,,25:17,24:44,1:31:22,25:17
Lara Parker,,,,,,,,,,,,,
Tammy Pelletier,,,,,,,,,,,,,
Maria Peters,0,3:20:25,2:18:15,28:21,,28:57,47:29,44:34,28:35,25:51,27:00,1:34:01,26:32
Jean Phelan,0,,2:30:59,,8:34.7,,48:47,45:54,33:25,,,1:36:14,
Marie Price,0,,,,12:19.2,,1:01:13,57:17,36:43,39:43,37:43,,
Wendy Rafferty,8,,,,8 - 7:17.6,,,41:19,36:29,26:35,,1:29:14,
Sharon Rodier,,,,,,,,,,,,,
Christine Schaffner,,,,,,,,,,,,,
Karen Schenck,0,,,,,43:15,,,,,42:51,,45:58
Elizabeth Schleif,,,,,,,,,,,,,
Michele Scott,,,,,,,,,,,,,
Lori Sherwood,0,,,,,36:15,57:43,55:38,37:03,,32:37,1:50:39,
Lydia Short,30,,,,,,,,,10 - 22:46,10 - 22:27,,10 - 21:54
Alicia Shoulta,,,,,,,,,,,,,
Susan Snead,0,2:35:16,,,,,,,,,,,
Debra Sommer,0,,,,,,,54:31,,,,,
Bethany Spector,,,,,,,,,,,,,
Shirley Stephens,0,,,,,31:10,53:51,50:04,,30:03,29:52,,31:42
Patricia Travis,0,,2:32:46,,,30:12,50:47,,,29:10,30:03,1:49:04,29:52
Lori Tubbs,,,,,,,,,,,,,
LaRonda White,,,,,,,,,,,,,
Patricia Wiedeman,,,,,,,,,,,,,
Sharon Wilkins,,,,,,,,,,,,,
Ingeborg Wobig,,,,,,,,,,,,,
Helen Worthington,16,,,,,8 - 26:08,8 - 47:04,,,26:15,26:22,1:31:36,
Tiffany Wynn,,,,,,,,,,,,,
Sharon Yager,,,,,,,,,,,,,
Brandi Zentz,,,,,,,,,,,,,
,,,,,,,,,,,,,
Masters Men,,,,,,,,,,,,,
Dale Abrahamson,0,,,,,,,,,P,P,P,
Ken Alberg,0,,,,,,,,P,,,,
David Anderson,22,,P,,,P,,,12,10,,,P
Larry Arata,0,,,,,P,P,,,,,,P
Gene Bachman,0,,,,,,,,,,,P,
Guy Beaver,,,,,,,,,,,,,
Leif Berner,0,,P,,,,,,,,,P,
Jimmy Blount,0,,,,,P,P,,,P,P,P,P
Jess Brown,0,P,P,P,P,P,P,P,P,P,P,P,P
Bob Brunner,16,P,P,8,8,P,P,P,P,P,P,,
Joe Buck,0,P,P,P,P,P,P,P,P,P,P,P,P
Andrea Buoso,62 (86),10,8,,,,10,12,20,8,10,8,
Richard Bush,0,,,,,,,,P,,,,
Joe Calkins,8,,P,,,8,,,,,,,
Jim Case,,,,,,,,,,,,,
Chris Catoe,,,,,,,,,,,,,
Stephen Chantry,12,,,,,12,,,,P,,,P
Brian Chiles,0,,P,P,P,P,P,P,P,P,P,P,P
Robert Curtin,0,,,P,,P,P,,,P,P,,P
Mike Daly,0,,,,,P,,,,,,P,P
Greg Dawson,22,,,,,P,P,,,,,10,12
Joe Day,0,,,,,,,,,,,P,
John DiCarlo,0,P,,P,P,,P,P,,P,P,P,P
Jim Duffy,10,P,P,,10,,P,P,,P,,P,P
Scott Fredrick,,,,,,,,,,,,,
Jamie Garrett,,,,,,,,,,,,,
Pete Gibson,,,,,,,,,,,,,
David Glass,0,,,,,P,P,,,P,,P,P
Richard Grant,40,P,P,10,12,P,P,8,10,,,P,
Jim Gullo,0,,,P,P,P,P,P,P,P,P,P,P
Bill Hart,,,,,,,,,,,,,
Randy Hawthorne,0,,,P,P,P,P,P,P,P,P,P,P
Tony Heimer,0,P,P,P,P,P,P,P,P,P,P,P,P
Thomas Hicks,55,20,,,,,,,,,15,20,
Richard Hildreth,0,,,,,,,P,P,,,,
Timothy Hodge,0,,,,,P,P,P,P,P,,,
Chris Holm,,,,,,,,,,,,,
Charles Inman,27,12,,15,,,,,,,,,
Robert Jean,0,,,P,,P,,,,P,P,P,P
Dwight Kane,0,,,,,P,,P,,,,,
Ken Kieft,0,,,,,,,P,P,,,,
George Knierbein,0,,,,,,,P,,,,,
Chris Laws,27,,15,,,,,,,12,,,
Jon Leiding,70,15,,12,20,P,8,P,15,P,P,,P
David Lockard,0,,P,,,,,,,,,,
Greg Lynn,80 (119),,12,20,,15,15,15,,15,12,15,15
John Markley,0,,,,,,,P,,P,P,,P
James Martin,0,P,,P,,,,P,P,,,,
Stacin Martin,,,,,,,,,,,,,
Andrew Medvec,,,,,,,,,,,,,
Jason Miller,72,,20,,,20,12,20,,,,,
William Murray,0,,,,,,,,,P,,,P
Grant Neely,,,,,,,,,,,,,
George Nelsen,,,,,,,,,,,,,
Dan Neuland,,,,,,,,,,,,,
Vincent Ortiz,,,,,,,,,,,,,
Chad Parker,,,,,,,,,,,,,
Paul Pelletier,50,,10,,,10,P,10,,,P,12,8
Steven Peters,0,,,P,,P,,,,,P,,
Richard Pidgeon,,,,,,,,,,,,,
John Piggott,,,,,,,,,,,,,
Rick Platt,0,,P,,,P,P,,,P,P,P,P
Bill Price,0,,P,P,P,,P,P,P,P,P,P,
John Price,0,,,,P,,,P,P,,,P,
Randy Proctor,,,,,,,,,,,,,
Kevin Rafferty,23,,,,15,,,P,8,P,,P,
Tom Randolph,0,P,,,,,,,,,,,
Robert Rantanen,0,,,P,,,,P,P,,,,
Andy Riley,80,,,,,,20,,,20,20,,20
Brett Riley,8,8,,,,,,,,,,,
Tim Robinson,,,,,,,,,,,,,
Ernest Schillinger,,,,,,,,,,,,,
Stephen Scudder,0,,,P,,P,,P,,,,,P
John Searing,0,,,P,,,,,,,,,
Steven Shapiro,0,,,,P,,P,P,,,,,
Ed Sharp,,,,,,,,,,,,,
Brook Sherman,0,P,,,,,,,,,,,
Steven Short,0,,,,,,P,,,P,P,,P
Steve Speirs,,,,,,,,,,,,,
Dwight Starks,0,,P,P,P,,,P,P,P,,P,P
Winston Trice,0,,P,,,,P,,,,P,P,
Alan Van Zandt,0,P,P,,,P,P,,,P,,P,
Joseph Verdirame,0,,,P,P,,P,P,P,P,P,P,
Scott Ward,,,,,,,,,,,,,
Rick Webb,,,,,,,,,,,,,
Gregg Weber,0,,P,,P,,,P,,,,P,
Tim Westfall,0,,,P,,,,,P,,,P,
Dean Wewetzer,,,,,,,,,,,,,
Robert Whitaker,18,,,,,,,,,P,8,P,10
David Whitted,,,,,,,,,,,,,
John Wills,0,P,,,,,,,P,,,,
Sam Wittenberg,,,,,,,,,,,,,
John Yager,,,,,,,,,,,,,
Matthew Zentz,0,,P,P,P,P,P,P,P,P,P,P,P
,,,,,,,,,,,,,
Masters Women,,,,,,,,,,,,,
Lisa Armistead,,,,,,,,,,,,,
Susan Ashley,,,,,,,,,,,,,
Nancy Atlee,0,,,,,P,,,,,P,,P
Barbara Biasi,0,,,,,,,,,,P,,
Gail Biermann,0,P,P,P,,,,,,,,P,
Betty Brothers,0,,,P,P,,,P,P,,,,
Jamie Callahan-Brill,0,P,,,,,,,,,,,
Kristi Chiles,48,P,10,P,P,15,15,P,P,P,P,,8
Tammi Clarke,0,P,,,,,,,,,P,,
Carla Cline,0,,,P,,,,,,,,P,
Amanda Collier,10,P,P,,,10,,,,,,P,
Jennifer Cornette,24,,,8,,,,,8,,,8,
Susan Davis,0,,,,,,,P,,,,P,
Virginia Davis,0,,,,,P,P,,P,P,P,P,P
Nancy Delaney,,,,,,,,,,,,,
Victoria Estes,P,,,P,P,,P,P,,P,P,,P
Thea Ganoe,0,P,,,,,,,,,,,
Martha Gullo,0,,,P,P,P,P,P,P,P,P,P,P
Susan Hagel,74 (124),10,P,10,12,,20,10,10,15,12,10,15
Kimberly Hague,0,,,,,,,P,,,,,
Catherine Harden,0,P,P,,,,,,,,,,
Karla Havens,,,,,,,,,,,,,
Julie Hicks,85 (145),15,,15,15,,,15,15,20,15,15,20
Dottie Humphreys,,,,,,,,,,,,,
Christie Ireland,0,,,,,,,P,,,P,,
Criztina Jean,0,,,P,,P,P,,,P,P,P,P
Kerry Johnson,52,20,20,,,,,12,,,,,
Valor Foy Jones,8,,8,,,,,,,,,,
Kirsten Kelly,63 (73),12,15,12,10,,,,12,,,12,
Deb Kopecky,,,,,,,,,,,,,
Susan Kreider,12,P,12,P,,,,,,,,,
Ruth Lamprecht,,,,,,,,,,,,,
Teresa Markley,0,,,,,,,P,,P,P,,P
Barbara Mathewson,,,,,,,,,,,,,
Bunny May,P,,,P,P,,P,P,,P,P,,P
Michelle Moore,8,8,,,,,,,,,,,
Jenny Moran,100 (140),,,20,20,20,,20,20,,20,20,
Daphne Papaefthimiou,42,,,,,,8,,,12,10,P,12
Tammy Pelletier,,,,,,,,,,,,,
Maria Peters,38,P,P,P,,8,10,P,P,10,P,P,10
Jean Phelan,0,,P,,P,,P,P,P,,,P,
Marie Price,0,,,,P,,P,P,P,P,P,,
Wendy Rafferty,16,,,,8,,,8,P,P,,P,
Sharon Rodier,,,,,,,,,,,,,
Christine Schaffner,,,,,,,,,,,,,
Karen Schenck,0,,,,,P,,,,,P,,P
Michele Scott,,,,,,,,,,,,,
Lori Sherwood,0,,,,,P,P,P,P,,P,P,
Alicia Shoulta,,,,,,,,,,,,,
Susan Snead,0,P,,,,,,,,,,,
Debra Sommer,0,,,,,,,P,,,,,
Shirley Stephens,0,,,,,P,P,P,,P,,,P
Patricia Travis,0,,P,,,P,P,,,P,P,P,P
Lori Tubbs,,,,,,,,,,,,,
LaRonda White,,,,,,,,,,,,,
Patricia Wiedeman,,,,,,,,,,,,,
Sharon Wilkins,,,,,,,,,,,,,
Ingeborg Wobig,,,,,,,,,,,,,
Helen Worthington,40,,,,,12,12,,,8,8,P,
Tiffany Wynn,,,,,,,,,,,,,
Sharon Yager,,,,,,,,,,,,,
Brandi Zentz,,,,,,,,,,,,,
,,,,,,,,,,,,,
Age Groups:,,,,,,,,,,,,,
,,,,,,,,,,,,,
Men 19 and under,,,,,,,,,,,,,
J. Robert Azaltovic III,,,,,,,,,,,,,
Magnus Chiles,103,,20,10,20,8,8,15,12,P,10,P,P
Evan Clary,100,,,20,,,20,,,20,,20,20
Glenn Glass,72,,,,,20,15,,,12,,10,15
Paul Glass,25,,,,,,,,,,,15,10
Isaac Lamprecht,42,,,,,15,12,,,15,,,
Braxton Lee,108,,,12,,12,10,20,15,8,15,8,8
Bryton Lee,69,,,15,,10,P,12,20,P,12,,P
Lorenzo Short,54,,,,,,,,,10,20,12,12
,,,,,,,,,,,,,
Men 20-24,,,,,,,,,,,,,
John Walker,20,,,20,,,,,,,,,
John Chiles,175,,20,15,20,20,20,20,20,20,,,20
,,,,,,,,,,,,,
Men 25-29,,,,,,,,,,,,,
Cameron Cruse,,,,,,,,,,,,,
Roger Hopper,160,,,20,20,20,20,,,20,20,20,20
Seth Kolosso,15,,15,,,,,,,,,,
Logan St. John,15,,,15,,,,,,,,,
William Thompson,50,,20,,,,15,,,15,,,
,,,,,,,,,,,,,
Men 30-34,,,,,,,,,,,,,
Christopher Brown,,,,,,,,,,,,,
Kyle Carlson,20,20,,,,,,,,,,,
Daniel Cunnane,27,,,12,,,,15,,,,,
Michael Dixon,,,,,,,,,,,,,
Ryan Doupe,15,,15,,,,,,,,,,
Marquis Harden,,,,,,,,,,,,,
Benjamin Kaurich,70,,10,,,15,15,,,15,,,15
Peter Mercredi,15,15,,,,,,,,,,,
Drew Midland,40,,20,,20,,,,,,,,
Frank Nixon,114,10,,15,15,,,20,,12,15,15,12
Dean Stover,44,12,,20,,,,12,,,,,
Jonathan Torres,132,,12,,,20,20,,,20,20,20,20
,,,,,,,,,,,,,
Men 35-39,,,,,,,,,,,,,
Matthew Franco,,,,,,,,,,,,,
Frank Leone,15,,,,,,,,,,,15,
Chris Novakoski,190,20,,20,20,20,20,20,20,15,,20,15
Adam Otstot,40,,,,,,,,,20,,,20
Michael Stallings,15,,,,,,,,15,,,,
,,,,,,,,,,,,,
Men 40-44,,,,,,,,,,,,,
Chris Laws,30,,15,,,,,,,15,,,
Jason Miller,75,,20,,,20,15,20,,,,,
Randy Proctor,,,,,,,,,,,,,
Andy Riley,80,,,,,,20,,,20,20,,20
Brett Riley,20,20,,,,,,,,,,,
Brook Sherman,15,15,,,,,,,,,,,
,,,,,,,,,,,,,
Men 45-49,,,,,,,,,,,,,
Andrea Buoso,121,12,15,,,,15,15,20,20,12,12,
Joe Calkins,27,,12,,,15,,,,,,,
Scott Fredrick,,,,,,,,,,,,,
Jamie Garrett,,,,,,,,,,,,,
David Glass,42,,,,,12,8,,,10,,P,12
Thomas Hicks,60,20,,,,,,,,,20,20,
Chris Holm,,,,,,,,,,,,,
Charles Inman,30,15,,15,,,,,,,,,
Greg Lynn,150,,20,20,,20,20,20,,,15,15,20
Grant Neely,0,,,,,,,,,,,,
Chad Parker,,,,,,,,,,,,,
Kevin Rafferty,72,,,,20,,,15,15,12,,10,
Steven Short,52,,,,,,12,,,15,10,,15
Winston Trice,36,,10,,,,10,,,,8,8,
Scott Ward,,,,,,,,,,,,,
,,,,,,,,,,,,,
Men 50-54,,,,,,,,,,,,,
David Anderson,88,,12,,,12,,,20,20,,12,12
Leif Berner,20,,10,,,,,,,,,10,
Brian Chiles,82,,P,10,12,8,10,P,10,12,12,P,8
Greg Dawson,70,,,,,15,20,,,,,15,20
George Knierbein,8,,,,,,,8,,,,,
David Lockard,15,,15,,,,,,,,,,
James Martin,64,20,,20,,,,12,12,,,,
Stacin Martin,,,,,,,,,,,,,
Paul Pelletier,130,,20,,,20,15,20,,,20,20,15
John Searing,12,,,12,,,,,,,,,
Steve Speirs,,,,,,,,,,,,,
Gregg Weber,38,,P,,15,,,15,,,,8,
David Whitted,,,,,,,,,,,,,
Matthew Zentz,130,,8,15,20,10,12,10,15,15,15,P,10
,,,,,,,,,,,,,
Men 55-59,,,,,,,,,,,,,
Ken Alberg,10,,,,,,,,10,,,,
Guy Beaver,,,,,,,,,,,,,
Bob Brunner,132,12,15,15,15,12,12,12,12,12,15,,
Joe Buck,108,10,12,10,10,8,8,8,P,8,10,12,12
Jim Case,,,,,,,,,,,,,
Robert Jean,84,,,12,,10,10,,,10,12,15,15
Ken Kieft,30,,,,,,,15,15,,,,
Jon Leiding,200,20,,20,20,20,20,20,20,20,20,,20
John Markley,8,,,,,,,P,,P,P,,8
Dan Neuland,,,,,,,,,,,,,
Vincent Ortiz,,,,,,,,,,,,,
Steven Peters,16,,,8,,P,,,,,8,,
John Piggott,,,,,,,,,,,,,
Tim Robinson,,,,,,,,,,,,,
Dwight Starks,68,,10,8,12,,,10,8,P,,10,10
Alan Van Zandt,85,15,20,,,15,15,,,15,,20,
,,,,,,,,,,,,,
Men 60-64,,,,,,,,,,,,,
Pete Gibson,,,,,,,,,,,,,
Tony Heimer,177,20,15,12,20,15,15,20,12,12,12,12,12
Timothy Hodge,73,,,,,20,20,15,10,8,,,
William Murray,30,,,,,,,,,15,,,15
Bill Price,124,,20,15,15,,12,12,15,10,15,10,
Rick Webb,,,,,,,,,,,,,
Tim Westfall,55,,,20,,,,,20,,,15,
Dean Wewetzer,,,,,,,,,,,,,
Robert Whitaker,80,,,,,,,,,20,20,20,20
John Yager,,,,,,,,,,,,,
,,,,,,,,,,,,,
Men 65-69,,,,,,,,,,,,,
Gene Bachman,0,,,,,,,,,,,P,
Jimmy Blount,34,,,,,8,P,,,8,10,8,P
Jess Brown,111,8,12,12,10,12,12,10,P,P,15,12,8
Stephen Chantry,60,,,,,20,,,,20,,,20
Robert Curtin,16,,,8,,P,P,,,P,8,,P
Joe Day,0,,,,,,,,,,,P,
Jim Duffy,120,15,15,,15,,15,15,,15,,15,15
Richard Grant,175,20,20,20,20,15,20,20,20,,,20,
Jim Gullo,115,,,15,12,10,10,12,12,12,20,P,12
Dwight Kane,0,,,,,P,,P,,,,,
George Nelsen,,,,,,,,,,,,,
Rick Platt,60,,10,,,P,8,,,10,12,10,10
John Price,16,,,,8,,,P,8,,,P,
Tom Randolph,12,12,,,,,,,,,,,
Robert Rantanen,28,,,10,,,,8,10,,,,
Steven Shapiro,0,,,,P,,P,P,,,,,
John Wills,25,10,,,,,,,15,,,,
Sam Wittenberg,,,,,,,,,,,,,
,,,,,,,,,,,,,
Men 70 and over,,,,,,,,,,,,,
Dale Abrahamson,60,,,,,,,,,20,20,20,
Larry Arata,32,,,,,12,10,,,,,,10
Richard Bush,12,,,,,,,,12,,,,
Chris Catoe,,,,,,,,,,,,,
Michael Daly,35,,,,,15,,,,,,8,12
John DiCarlo,157,20,,20,20,,20,12,,15,15,15,20
Bill Hart,,,,,,,,,,,,,
Randy Hawthorne,133,,,12,12,20,12,15,15,12,10,10,15
Richard Hildreth,20,,,,,,,10,10,,,,
Andrew Medvec,,,,,,,,,,,,,
Richard Pidgeon,,,,,,,,,,,,,
Ernest Schillinger,,,,,,,,,,,,,
Stephen Scudder,36,,,10,,10,,8,,,,,8
Ed Sharp,,,,,,,,,,,,,
Joseph Verdirame,119,,,15,15,,15,20,20,10,12,12,
,,,,,,,,,,,,,
Women 19 and under,,,,,,,,,,,,,
Cannon Jean,122,,,15,,20,20,,,20,20,15,12
Sorenna Jean,60,,,20,,,,,,,,20,20
Lydia Short,45,,,,,,,,,15,15,,15
,,,,,,,,,,,,,
Women 20-24,,,,,,,,,,,,,
None,,,,,,,,,,,,,
,,,,,,,,,,,,,
Women 25-29,,,,,,,,,,,,,
Emily Honeycutt,60,,,,,,20,,,20,,,20
,,,,,,,,,,,,,
Women 30-34,,,,,,,,,,,,,
Danielle Arristide,,,,,,,,,,,,,
Samantha Bradley,,,,,,,,,,,,,
Kallen Carlson,,,,,,,,,,,,,
Erin Gedicke,40,,,,,20,,,,,,20,
Tiffany Griffin,,,,,,,,,,,,,
Lara Parker,,,,,,,,,,,,,
Bethany Spector,,,,,,,,,,,,,
,,,,,,,,,,,,,
Women 35-39,,,,,,,,,,,,,
Jessica Anderson,100,,,,,20,,,20,20,,20,20
Megan Doty,35,15,20,,,,,,,,,,
Maryanne Lee,113,,,,,12,15,12,12,12,20,15,15
Stephanie Manny,,,,,,,,,,,,,
Renee Merchant,40,20,,,,,,20,,,,,
Rachel Novakoski,132,12,,20,20,15,20,15,15,15,,,
Elizabeth Schleif,,,,,,,,,,,,,
,,,,,,,,,,,,,
Women 40-44,,,,,,,,,,,,,
Amanda Collier,52,12,15,,,15,,,,,,10,
Julie Hicks,155,15,,15,15,,,15,15,20,15,15,20
Kerry Johnson,52,20,20,,,,,12,,,,,
Jenny Moran,140,,,20,20,20,,20,20,,20,20,
Daphne Papaefthimiou,74,,,,,,20,,,15,12,12,15
Alicia Shoulta,,,,,,,,,,,,,
Brandi Zentz,,,,,,,,,,,,,
,,,,,,,,,,,,,
Women 45-49,,,,,,,,,,,,,
Kristi Chiles,168,15,20,12,12,20,15,12,12,12,15,8,15
Jennifer Cornette,45,,,15,,,,,15,,,15,
Susan Davis,18,,,,,,,8,,,,10,
Susan Hagel,215,20,15,20,20,,20,20,20,20,20,20,20
Kimberly Hague,10,,,,,,,10,,,,,
Christie Ireland,12,,,,,,,P,,,12,,
Ruth Lamprecht,,,,,,,,,,,,,
Tammy Pelletier,,,,,,,,,,,,,
Wendy Rafferty,67,,,,15,,,15,10,15,,12,
Tiffany Wynn,,,,,,,,,,,,,
,,,,,,,,,,,,,
Women 50-54,,,,,,,,,,,,,
Jamie Callahan-Brill,15,15,,,,,,,,,,,
Carla Cline,27,,,12,,,,,,,,15,
Nancy Delaney,,,,,,,,,,,,,
Catherine Harden,22,10,12,,,,,,,,,,
Criztina Jean,122,,,10,,20,20,,,20,20,12,20
Kirsten Kelly,120,20,20,20,20,,,,20,,,20,
Susan Kreider,42,12,15,15,,,,,,,,,
Teresa Markley,60,,,,,,,15,,15,15,,15
Marie Price,89,,,,15,,15,20,15,12,12,,
Sharon Wilkins,,,,,,,,,,,,,
Ingeborg Wobig,,,,,,,,,,,,,
,,,,,,,,,,,,,
Women 55-59,,,,,,,,,,,,,
Lisa Armistead,,,,,,,,,,,,,
Susan Ashley,,,,,,,,,,,,,
Tammi Clarke,32,20,,,,,,,,12,,,
Victoria Estes,101,,,15,20,,12,12,,15,12,,15
Karla Havens,,,,,,,,,,,,,
Valor Foy Jones,20,,20,,,,,,,,,,
Deb Kopecky,,,,,,,,,,,,,
Maria Peters,210,15,15,20,,20,20,20,20,20,20,20,20
Christine Schaffner,,,,,,,,,,,,,
Michele Scott,,,,,,,,,,,,,
Lori Sherwood,90,,,,,15,15,15,15,,15,15,
Lori Tubbs,,,,,,,,,,,,,
LaRonda White,,,,,,,,,,,,,
,,,,,,,,,,,,,
Women 60-64,,,,,,,,,,,,,
Gail Biermann,70,15,20,20,,,,,,,,15,
Thea Ganoe,12,12,,,,,,,,,,,
Michelle Moore,20,20,,,,,,,,,,,
Jean Phelan,115,,15,,20,,20,20,20,,,20,
Sharon Rodier,,,,,,,,,,,,,
Shirley Stephens,90,,,,,20,15,15,,20,,,20
Patricia Wiedeman,,,,,,,,,,,,,
Sharon Yager,,,,,,,,,,,,,
,,,,,,,,,,,,,
Women 65-69,,,,,,,,,,,,,
Nancy Atlee,28,,,,,8,,,,,8,,12
Martha Gullo,155,,,20,20,12,12,20,20,12,12,12,15
Dottie Humphreys,,,,,,,,,,,,,
Bunny May,70,,,15,15,,10,12,,10,P,,8
Karen Schenck,30,,,,,10,,,,,10,,10
Susan Snead,20,20,,,,,,,,,,,
Debra Sommer,15,,,,,,,15,,,,,
Patricia Travis,115,,20,,,15,15,,,15,15,15,20
Helen Worthington,100,,,,,20,20,,,20,20,20,
,,,,,,,,,,,,,
Women 70 and over,,,,,,,,,,,,,
Barbara Biasi,20,,,,,,,,,,20,,
Betty Brothers,80,,,20,20,,,20,20,,,,