,Total,DS 15 Miler,Heart 10 Miler,Colonial Half,Queens Lake 5K,Yorktown 10K,DOG 5K,Heroes 4 Miler,Freedom 8K,Quest 5K,Scholarship 5K,Strider Mile,Democracy 10K,ERR 10K,XC Classic 5K,Yorktown 10 Miler,Piankatank 5K,Haiti 5K,Sleighbell 5K
Overall Men,,,,,,,,,,,,,,,,,,,
Dale Abrahamson,8,,1:24:00,,24:07,49:10,22:59,,40:18,,,,,,26:00,1:25:38,8 - 24:15,24:21,24:18
Ken Alberg,0,,,,,,,30:47,,23:40,,,51:56,57:28,,,,,20:37
David Anderson,18,,,1:34:11,19:54,,19:36,, 8 - 34:21,20:50,,,42:09,42:12,,,,10 - 20:40,20:30
Larry Arata,0,,,,,,30:31,,,,,,,,,,,,
Gene Bachman,0,,,,,,,32:05,,,25:32,,,51:36,,,,,
Leif Berner,0,,,2:28:59,,,,,,,,,56:02,54:15,,,,,
Jimmy Blount,0,,,,30:59,1:02:34,28:25,,,30:52,,,1:04:03,,,,,,28:13
Forest Braden,15,,,,,,,,,,,,,,,15 - 55:58,,,
Dillon Britt,0,,,,,,,,,,,,,41:34,,,,,
Jess Brown,0,2:31:40,1:28:07,2:11:20,25:44,51:34,,,,26:07,25:03,7:42.4,52:19,51:38,26:01,1:25:29,27:24,25:17,
Joe Buck,0,2:38:32,1:35:44,2:10:24,25:53,,25:20,33:13,43:07,,25:57,,53:24,53:08,27:44,,,25:33,25:01
Andrea Buoso,32,8 - 1:47:28,,1:32:28,8 - 19:47,41:03,,8 - 25:47,,20:29,8 - 19:56,,41:46,,,,,,
Richard Bush,,,,,,,,,,,,,,,,,,,
Joe Calkins,34,,,1:32:20,10 - 19:33,,19:25,,,8 - 20:22,,,8 - 40:40,,,,,,8 - 19:53
Kyle Carlson,34,12 - 1:42:54,,,,,,,,,,12 - 5:18.0,,10 - 39:56,,,,,
Stephen Chantry,0,,,,19:53,,19:54,,,,,,,,,,,,
Brian Chiles,,,,,,,,,,,,,,,,,,,
John Chiles,0,,1:23:40,,23:53,,,30:39,40:09,,29:47,6:31.5,,51:53,32:10,,,28:33,
Magnus Chiles,0,,,,,,,42:02,,,,,,,34:17,,,,
Evan Clary,,,,,,,,,,,,,,,,,,,
Robert Curtin,0,,,3:23:39,,1:42:21,53:49,1:08:22,1:23:00,53:54,50:53,,1:43:51,1:43:28,53:14,2:50:30,47:05,,50:57
Mike Daly,0,,,,,,28:43,,,,,,1:09:38,,,,,,
Christopher Davis,,,,,,,,,,,,,,,,,,,
Greg Dawson,,,,,,,,,,,,,,,,,,,
Joe Day,,,,,,,,,,,,,,,,,,,
John DiCarlo,0,,1:38:37,,26:38,,26:32,,,27:15,26:10,7:36.6,53:15,53:46,,1:44:57,26:40,26:40,26:34
Mark Doolan,,,,,,,,,,,,,,,,,,,
Ryan Doupe,,,,,,,,,,,,,,,,,,,
Jim Duffy,0,2:11:25,,1:48:03,21:54,46:36,,29:32,37:22,,22:31,6:28.0,,45:55,24:52,1:24:03,,24:23,
Louis Dwyer,,,,,,,,,,,,,,,,,,,
Ed Elmore,0,,,,23:25,,22:55,,,,,,,,,,,,
John Epps,0,,1:41:51,2:17:24,27:55,,26:20,36:18,50:36,44:55,,,1:06:06,1:01:23,,1:47:19,25:00,24:07,
Scott Fredrick,10,2:11:56,1:21:41,1:52:33,23:00,48:14,,30:04,39:11,,23:30,6:44.7,51:52,,24:37,1:27:39,10 - 22:53,23:19,
Chris Free,47,,,,,,,,,,15 - 16:29,20 - 4:40.9,,12 - 34:19,27:49,,,,
Tom Gerhardt,0,,,,,,35:55,,,36:43,,,1:17:32,,,,,,35:19
David Glass,0,,,,25:26,,,,,,,,,,,,,,25:00
Glenn Glass,,,,,,,,,,,,,,,,,,,
Richard Grant,15,,,,22:21,45:41,21:32,27:42,35:20,,24:13,6:51.3,50:42,47:01,24:26,1:15:49,15 - 21:33,,
Jim Gullo,0,,,,,52:23,24:26,,41:33,,,,52:48,52:52,,,,24:56,24:54
Randy Hawthorne,0,,,,,,30:43,,52:59,,,,,,,,,35:40,
Tony Heimer,0,2:16:44,1:29:18,1:57:58,26:59,,24:53,34:50,46:00,29:09,27:29,,56:24,56:23,27:20,1:33:59,,,
Thomas Hicks,100 (122),20 - 1:38:06,,12 - 1:23:10,,15 - 36:22,,15 - 22:32,15 - 29:52,,,15 - 4:54.6,10 - 35:37,,,,,,20 - 17:13
Richard Hildreth,0,,,,,1:09:26,,,,,,,,,34:19,,,,
Timothy Hodge,0,,,,26:09,54:36,24:48,,41:55,25:44,24:36,6:39.5,54:00,53:13,25:20,,24:32,23:57,23:36
Roger Hopper,120 (220),,20 - 57:38,20 - 1:11:24,,20 - 32:52,20 - 15:15,20 - 20:17,20 - 25:36,20 - 15:57,20 - 15:25,,20 - 31:52,20 - 32:16,,20 - 54:21,,,
Charles Inman,,,,,,,,,,,,,,,,,,,
Robert Jean,0,,,,24:57,52:44,24:21,,43:37,26:34,,,55:57,54:57,,1:35:48,24:22,24:09,
Dwight Kane,0,,,,,,40:54,52:16,,,41:00,11:41.1,,1:24:12,,,,,
Steven Kast,23,,,,15 - 18:29,,18:21,,,,,,,,,8 - 1:12:57,,,
Benjamin Kaurich,0,,,2:03:20,24:12,52:15,23:36,,,,,,48:01,,,,,,
Avinash Kelley,0,2:23:14,,1:45:39,,,,31:10,,,26:57,7:55.5,,47:34,,,,,
Adam Kenyon,15,,15 - 59:47,,,,,,,,,,,,,,,,
Ken Kieft,0,2:06:05,,,,50:22,,30:19,,,24:04,6:41.4,,49:55,25:06,1:25:26,,,
Isaac Lamprecht,44,,,,20 - 16:17,,12 - 15:43,,,,,,12 - 35:14,,,,,,
Chris Laws,12,,1:06:17,1:26:46,,,,,,,,,,,,,,12 - 20:08,
Braxton Lee,0,2:26:12,1:23:48,1:59:37,,50:10,,30:41,41:28,27:40,25:48,6:35.6,1:03:44,50:36,,1:31:13,,23:33,23:12
Bryton Lee,0,,,,,,,39:14,53:07,,28:56,6:54.9,1:07:48,,,,,26:38,25:08
Jon Leiding,10,10 - 1:45:02,,,,,19:58,26:05,,20:41,,6:05.5,42:33,43:05,,,,,
David Lockard,0,,,,,,,,,,,,,,,,,29:34,
Greg Lynn,30,,,1:34:25,12 - 18:54,8 - 40:25,18:49,,10 - 32:11,,,,,,,,,,
John Markley,0,,,,,,,50:05,,,,,,,,,,,
James Martin,0,,,,,,,,,,26:32,,,,,,,,
Matt McCombs,0,,,,,58:59,,,,,28:05,6:47.6,,1:09:22,,1:58:39,,,
Tobin McMurdie,40,1:52:29,,,,,,,,21:18,20:39,5:56.3,44:01,,15 - 20:40,1:15:56,,15 - 19:57,10 - 19:40
Jason Miller,18,,,10 - 1:25:46,,, 8 - 17:55,,,,,,,,,,,,
John Munday,0,,,,,1:30:06,39:49,51:49,1:08:56,,41:47,11:29.8,1:26:28,1:24:51,42:50,2:27:29,39:38,39:07,
William Murray,0,,1:26:23,1:56:56,22:54,,,,,,,,,,,,,,
Grant Neely,0,,,2:25:04,,,,,,,,,,,,,,,
Frank Nixon,,,,,,,,,,,,,,,,,,,
Chris Novakoski,91 (135),15 - 1:42:31,8 - 1:04:33,8 - 1:25:59,,10 - 39:36,,12 - 24:57,,12 - 19:40,12 - 19:08,10 - 5:31.4,,8 - 40:02,20 - 20:21,,,20 - 19:21,
Steve Olson,0,2:37:24,,,,47:50,,,,,24:32,,,,23:50,1:33:45,,,
Adam Otstot,45,,,,,,15 - 15:22,,,,,,15 - 33:19,15 - 33:19,,,,,
Paul Pelletier,0,,,1:30:54,,41:21,19:49,,,,,,,,,,,,20:01
Steven Peters,0,,,,,1:09:54,29:15,,,,31:57,,,1:12:45,,2:21:14,,,
Wayne Phelps,28,,1:20:25,,,48:13,,29:41,,22:31,22:18,,47:22,48:05,8 - 23:15,1:23:18,12 - 21:38,8 - 22:34,
Rick Platt,0,,,,,,,,1:18:44,,,,,,,,45:11,,46:40
Alexey Popov,0,,,,30:41,1:04:08,30:54,39:40,,30:14,29:04,8:56.5,59:31,58:28,30:14,,29:40,,
Bill Price,0,,1:21:59,1:54:06,23:45,49:24,23:22,30:58,41:17,27:08,25:35,7:41.2,54:57,54:15,26:41,,25:25,25:23,
John Price,0,,,,,1:04:30,,51:25,,,32:59,9:20.1,,,,,,,
Kevin Rafferty,10,2:04:05,,,,46:00,,28:43,,23:34,22:47,6:24.8,46:47,46:47,10 - 22:52,,,,
Tom Randolph,,,,,,,,,,,,,,,,,,,
Robert Rantanen,0,,,,,,,36:15,,,27:03,,,58:43,28:59,,,,
Andy Riley,,,,,,,,,,,,,,,,,,,
Brett Riley,12,,,,,,,26:14,,,20:07,5:52.1,,40:49,12 - 20:42,,,,
Basil Rowell,0,,,,,55:53,25:10,34:25,,,27:36,,,57:41,28:08,,,,
Yosif Rowell,0,,,,,,,29:10,,,24:37,,,47:09,,,,,
Stephen Scudder,0,,2:20:18,,41:20,,41:02,1:03:43,1:21:22,52:18,48:07,13:01.2,1:43:47,1:39:39,52:14,,,,50:54
John Searing,,,,,,,,,,,,,,,,,,,
Steven Shapiro,0,,2:07:46,,,,,48:35,,,38:51,,,1:22:53,43:57,,,,
Daniel Shean,12,,12 - 1:01:26,,,,,,,,,,,,,,,,
Lorenzo Short,10,,,,,,10 - 17:22,,,,,,,,,,,,
Steven Short,0,,,,,,20:18,,,,,,,,,,,,21:06
Jordan Spector,52,,10 - 1:03:34,,,,,10 - 25:32,12 - 31:36,10 - 19:51,10 - 19:48,,,,,,,,
Logan St. John,,,,,,,,,,,,,,,,,,,
Michael Stallings,,,,,,,,,,,,,,,,,,,
Dwight Starks,0,,1:57:25,2:52:41,27:52,,27:13,35:55,,29:01,28:49,,1:04:30,1:08:19,28:12,1:51:43,27:58,,
Dean Stover,0,2:08:52,,,,,,29:59,,,26:58,6:18.3,,49:29,,,,,
Jonathan Thornberry,0,,,,,,,33:01,,,,,,,,,,,
Jonathan Torres,67 (72),,,15 - 1:21:49,,12 - 38:23,,,,15 - 18:31,,,10 - 39:43,,,10 - 1:11:56,,,15 - 18:28
Joseph Verdirame,0,2:33:58,1:33:49,,36:27,1:02:21,27:43,,,,30:29,8:07.1,58:58,59:33,29:29,,,28:08,
Rick Webb,0,,,,42:27,,41:37,,1:11:30,,,,,,,,43:24,41:01,42:57
Gregg Weber,0,2:18:16,1:27:38,,,53:27,25:34,33:30,,,26:28,7:12.4,,55:56,26:44,1:31:37,,,
Tim Westfall,0,,,,,49:42,,33:59,,,26:21,,,,25:14,,24:19,,
Robert Whitaker,52,,,,20:53,43:00,20:09,,,21:08,,8 - 5:38.1,41:51,40:50,,12 - 1:09:25,20 - 19:18,,12 - 19:35
John Wills,0,,1:25:24,1:53:25,,,,33:03,,,25:09,7:28.4,,54:10,25:56,1:29:21,,,
Matthew Zentz,0,2:23:10,1:31:26,2:03:07,25:21,52:43,24:09,33:05,44:32,28:47,28:39,7:05.4,57:42,57:39,26:33,,,,
,,,,,,,,,,,,,,,,,,,
Overall Women,Total,DS 15 Miler,Heart 10 Miler,Colonial Half,Queens Lake 5K,Yorktown 10K,DOG 5K,Heroes 4 Miler,Freedom 8K,Quest 5K,Scholarship 5K,Strider Mile,Democracy 10K,ERR 10K,XC Classic 5K,Yorktown 10 Miler,Piankatank 5K,Haiti 5K,Sleighbell 5K
Jessica Anderson,58 (66),,,,15 - 25:34,,23:44,,8 - 39:53,8 - 24:03,,,8 - 49:32,50:11,,,,15 - 23:36,12 - 23:24
Nancy Atlee,0,,,,,,45:31,,,,,,,,,,,,
Barbara Biasi,0,,,,,,,,57:46,,,,,,,,33:36,33:31,
Gail Biermann,0,,1:45:20,2:23:28,,,,,,,30:35,,1:06:00,1:09:53,32:27,1:52:09,,,
Betty Brothers,8,8 - 2:37:45,,,,55:55,,,,,26:32,8:09.2,,55:48,30:41,,,,
Jami Callahan-Brill,8,,8 - 1:31:09,,,,,,,,,,,,,,,,
Kristi Chiles,16,2:48:38,1:37:24, 2:19:21,8 - 28:00,59:37,,42:03,45:44,,27:49,8 - 7:57.0,,1:02:41,32:11,,,28:34,
Tammi Clarke,10,,,,,,,,,,,,,55:57,,,10 - 26:06,,
Carla Cline,0,,,2:29:08,,,,,,,31:47,,,1:17:40,,,,,
Amanda Collier,0,2:54:14,1:42:45, 2:19:41,,1:00:32,,,48:02,,,,,,,1:50:48,,28:55,
Jennifer Cornette,16,,,,,54:08,,34:00,,,26:20,,,,8 - 28:12,,,8 - 26:27,
Susan Davis,0,,,,,,,,,,,,,1:04:26,,,,,
Virginia Davis,0,,,,,,,53:29,,,37:03,,,1:17:39,37:19,,,,
Kelly Doolan,,,,,,,,,,,,,,,,,,,
Ellie Epps,47,,1:41:50,2:17:24,10 - 27:49,,26:18,36:11,50:36,28:04,,10 - 7:41.8,58:26,1:01:50,,1:47:18,15 - 24:03,12 - 24:20,
Jessica Epps,0,,1:50:42,2:23:41,29:03,,29:38,,51:57,30:18,29:53,8:41.6,1:06:06,1:11:54,31:55,2:02:05,,29:05,28:21
Victoria Estes,0,,,,,1:39:23,,1:00:23,,,,,,,,,,,
Marjorie Friedrichs,32,,,,,,22:32,,,10 - 23:27,,,12 - 47:16,10 - 47:31,,,,,
Thea Ganoe,0,,1:52:19,2:38:15,,1:05:15,,,54:36,,,,,1:11:55,,,33:01,,
Erin Gedicke,,,,,,,,,,,,,,,,,,,
Svetlana Goncharova,102 (140),,10 - 1:22:28,,20 - 21:15,8 - 45:01,8 - 21:30,,12 - 36:51,15 - 22:15,,,15 - 46:08,12 - 45:04,,20 - 1:17:31,20 - 21:22,,
Karen Grabowski,35,,15 - 1:15:36,,,,28:01,,,,,,,,,,,,20 - 21:44
Martha Gullo,0,,,,,1:17:44,33:01,,58:24,,,,1:08:12,1:09:08,,,,33:04,
Susan Hagel,56 (64),,,,,54:10,24:37,10 - 33:18,44:02,,,12 - 7:30.1,,,12 - 26:29,8 - 1:37:01,12 - 25:10,10 - 26:09,
Kimberly Hague,,,,,,,,,,,,,,,,,,,
Carol Hansen-Vessa,0,,1:40:22,2:20:50,28:44,,28:18,,,32:49,,,1:05:27,,,1:54:04,,27:14,27:10
Julie Hicks,84,15 - 2:14:32,,12 - 1:52:03,,,,15 - 31:10,40:23,,12 - 24:05,20 - 6:41.7,50:40,52:00,,10 - 1:28:30,,,
Emily Honeycutt,105 (117),,,,,12 - 41:58,15 - 19:43,,15 - 32:58,20 - 19:59,,,20 - 39:42,15 - 39:06,,,,20 - 18:58,
Michelle Hooper,0,,,,,1:01:27,26:49,38:57,51:49,31:11,29:37,,1:02:44,1:02:51,30:55,1:53:48,29:14,,27:33
Cannon Jean,30,,,,,10 - 44:14,10 - 21:20,,42:50,26:26,10 - 24:43,,,,,,,,25:04
Criztina Jean,0,,,,,1:02:54,28:50,,48:21,32:16,30:52,,1:03:11,1:06:48,,1:57:36,30:14,29:21,28:20
Sorenna Jean,32,,,,,,,,,12 - 23:21,20 - 22:10,,,,,,,,
Christina Johnsen,0,,,,,,,45:02,,,34:18,9:02.4,,1:12:42,36:07,,,,
Kerry Johnson,10,,,10 - 1:52:38,,,,,,,,,,,,,,,
Valor Foy Jones,8,,1:33:21,2:09:51,,,25:02,,44:33,,,,57:52,56:43,,1:44:45,8 - 28:13,27:07,26:18
Kirsten Kelly,89 (107),12 - 2:18:50,12 - 1:19:07,15 - 1:48:06,,,,,,,15 - 23:37,,10 - 49:00,8 - 48:45,20 - 25:43,15 - 1:23:47,,,
Susan Kreider,63,10 - 2:25:24,,8 - 1:57:37,,,,8 - 33:23,42:12,,27:28,,,53:26,15 - 26:09,12 - 1:25:53,,,10 - 24:23
Maryanne Lee,0,2:46:59,1:40:08,2:17:48,,1:02:07,,40:35,53:19,31:27,31:27,8:29.7,1:07:49,1:04:09,,,,30:35,30:48
Anna MacLeod,0,,,,,,,,,,,,,55:28,,,,,
Teresa Markley,0,,,,,,34:05,49:22,,38:14,37:13,10:10.4,,,,,,,
Barbara Mathewson,,,,,,,,,,,,,,,,,,,
Bunny May,0,,,,,,,1:01:12,1:22:35,,,,1:43:49,1:50:32,,,50:06,,50:25
Connie McKeon,0,,,,,,,,1:04:55,,39:33,11:08.7,,1:19:37,43:49,2:14:22,,,
Renee Merchant,20,,,,,,20 - 19:27,,,,,,,,,,,,
Michelle Moore,0,,,,,,,,,,,,,1:23:15,,,,,
Jenny Moran,35,20 - 1:45:55,,,,15 - 41:17,,,,,,,,,,,,,
Rachel Novakoski,0,,,,,,,42:19,,,32:12,8:28.8,,1:09:56,34:01,,,,
Daphne Papaefthimiou,8,,,,,,24:05,,,,,,,,,,,,8 - 24:48
Maria Peters,0,2:54:14,,,,55:46,,,,28:25,,,,1:02:53,,1:49:20,29:11,,
Jean Phelan,12,,1:37:16,2:23:18,12 - 26:37,56:09,26:02,34:42,45:30,,32:52,,,1:01:45,34:39,,,28:43,27:20
Norma Phillips,0,,,,,,,,,,,,,53:48,,,,,
Marie Price,0,,2:05:58,,36:51,1:16:03,36:22,41:35,57:20,39:15,34:49,9:37.0,1:09:55,1:09:17,34:23,,31:47,31:24,
Wendy Rafferty,45,,,,,52:59,,12 - 32:22,,25:57,8 - 25:16,15 - 7:15.3,51:59,53:16,10 - 26:38,,,,
Rhonda Russell,,,,,,,,,,,,,,,,,,,
Kelly Russo,0,,,,,,,,,,,,,1:01:18,,,,,
Christine Schaffner,0,,1:40:23,,,55:39,,,,,,,,,,1:39:20,,,
Karen Schenck,0,,,,,,45:30,,,,47:27,,,,,,,,
Lori Sherwood,0,,1:54:43,,,,29:55,,1:04:51,,39:10,9:38.8,,1:22:27,35:47,,,,
Lydia Short,27,,,,,,12 - 20:56,,,,,,,,,,,,15 - 22:27
Susan Snead,,,,,,,,,,,,,,,,,,,
Debra Sommer,0,,,,,,,,,,32:32,,,1:13:30,34:56,,,,
Maria Spady,80,,,20 - 1:22:09,,20 - 37:44,,,20 - 30:27,,,,,20 - 37:29,,,,,
Bethany Spector,50,,20 - 1:08:10,,,,,20 - 29:25,10 - 38:46,27:13,40:54,,,,,,,,
Jennifer St. Martin,,,,,,,,,,,,,,,,,,,
Shirley Stephens,0,,,,30:43,1:04:16,29:53,,53:22,32:18,31:51,,1:10:32,,,,31:43,31:20,31:34
Patricia Travis,0,,1:43:23,2:26:12,29:47,,28:41,,51:23,32:53,,,1:06:49,1:08:24,,2:16:18,,31:52,30:42
Elise Walton,0,2:40:18,,,,,,38:07,,,29:20,8:31.5,,1:02:25,30:05,,,,
Christine Williams,0,,,,,,,,51:30,31:56,,,1:08:03,,,,,,29:01
Helen Worthington,0,,,,,,,,47:47,,,,,,,,31:55,30:53,
,,,,,,,,,,,,,,,,,,,
Masters Men,Total,DS 15 Miler,Heart 10 Miler,Colonial Half,Queens Lake 5K,Yorktown 10K,DOG 5K,Heroes 4 Miler,Freedom 8K,Quest 5K,Scholarship 5K,Strider Mile,Democracy 10K,ERR 10K,XC Classic 5K,Yorktown 10 Miler,Piankatank 5K,Haiti 5K,Sleighbell 5K
Dale Abrahamson,8,,P,,P,P,P,,P,,,,,,P,P,8,P,P
Ken Alberg,0,,,,,,,P,,P,,,P,P,,,,,P
David Anderson,38,,,P,P,,P,,12,8,,,P,8,,,,10,P
Larry Arata,0,,,,,,P,,,,,,,,,,,,
Gene Bachman,0,,,,,,,P,,,P,,,P,,,,,
Leif Berner,0,,,P,,,,,,,,,P,P,,,,,
Jimmy Blount,0,,,,P,P,P,,,P,,,P,,,,,,P
Jess Brown,0,P,P,P,P,P,,,,P,P,P,P,P,P,P,P,P,
Joe Buck,0,P,P,P,P,,P,P,P,,P,,P,P,P,,,P,P
Andrea Buoso,59 (69),10,,P,10,10,,12,,12,15,,10,,,,,,
Richard Bush,,,,,,,,,,,,,,,,,,,
Joe Calkins,49 (57),,,P,12,,8,,,15,,,12,,,,,,10
Stephen Chantry,8,,,,8,,P,,,,,,,,,,,,
Brian Chiles,,,,,,,,,,,,,,,,,,,
Robert Curtin,0,,,P,,P,P,P,P,P,P,,P,P,P,P,P,,P
Mike Daly,0,,,,,,P,,,,,,P,,,,,,
Greg Dawson,,,,,,,,,,,,,,,,,,,
Joe Day,,,,,,,,,,,,,,,,,,,
John DiCarlo,0,,P,,P,,P,,,P,P,P,P,P,,P,P,P,P
Mark Doolan,,,,,,,,,,,,,,,,,,,
Jim Duffy,8,P,,P,P,P,,P,8,,P,P,,P,P,P,,P,
Louis Dwyer,,,,,,,,,,,,,,,,,,,
Ed Elmore,0,,,,P,,P,,,,,,,,,,,,
John Epps,0,,P,P,P,,P,P,P,P,,,P,P,,P,P,P,
Scott Fredrick,18,P,8,P,P,P,,P,P,,P,P,P,,P,P,10,P,
Tom Gerhardt,0,,,,,,P,,,P,,,P,,,,,,P
David Glass,0,,,,P,,,,,,,,,,,,,,P
Richard Grant,37,,,,P,P,P,P,10,,P,P,P,P,P,12,15,,
Jim Gullo,0,,,,,P,P ,,P,,,,P,P,,,,P,P
Randy Hawthorne,0,,,,,,P,,P,,,,,,,,,P,
Tony Heimer,0,P,P,P,P,,P,P,P,P,P,,P,P,P,P,,,
Thomas Hicks,120 (155),20,,20,,20,,20,20,,,20,15,,,,,,20
Richard Hildreth,0,,,,,P,,,,,,,,,P,,,,
Timothy Hodge,0,,,,P,P,P,,P,P,P,P,P,P,P,,P,P,P
Charles Inman,,,,,,,,,,,,,,,,,,,
Robert Jean,0,,,,P,P,P,,P,P,,,P,P,,P,P,P,
Dwight Kane,0,,,,,,P,P,,,P,P,,P,,,,,
Steven Kast,47,,,,20,,12,,,,,,,,,15,,,
Avinash Kelley,0,P,,P,,,,P,,,P,P,,P,,,,,
Adam Kenyon,20,,20,,,,,,,,,,,,,,,,
Ken Kieft,0,P,,,,P,,P,,,P,P,,P,P,P,,,
Chris Laws,34,,12,10,,,,,,,,,,,,,,12,
Jon Leiding,32,12,,,,,,10,,10,,P,P,P,,,,,
David Lockard,0,,,,,,,,,,,,,,,,,P,
Greg Lynn,52,,,P,15,12,10,,15,,,,,,,,,,
John Markley,0,,,,,,,P,,,,,,,,,,,
James Martin,0,,,,,,,,,,P,,,,,,,,
Tobin McMurdie,70 (78),8,,,,,,,,P,10,8,P,,15,10,,15,12
Jason Miller,30,,,15,,,15,,,,,,,,,,,,
John Munday,0,,,,,P,P,P,P,,P,P,P,P,P,P,P,P,
William Murray,0,,P,P,P,,,,,,,,,,,,,,
Grant Neely,0,,,P,,,,,,,,,,,,,,,
Chris Novakoski,110 (182),15,15,12,,15,,15,,20,20,15,,15,20,,,20,
Steve Olson,0,P,,,,P,,,,,P,,,,P,P,,,
Adam Otstot,60,,,,,,20,,,,,,20,20,,,,,
Paul Pelletier,24,,,8,,8,P,,,,,,,,,,,,8
Steven Peters,0,,,,,P,P,,,,P,,,P,,P,,,
Wayne Phelps,46 (54),,10,,,P,,P,,P,8,,P,P,8,8,12,8,
Rick Platt,0,,,,,,,,P,,,,,,,,P,,P
Bill Price,0,,P,P,P,P,P,P,P,P,P,P,P,P,P,,P,P,
John Price,0,,,,,P,,P,,,P,P,,,,,,,
Kevin Rafferty,10,P,,,,P,,P,,P,P,P,P,P,10,,,,
Tom Randolph,,,,,,,,,,,,,,,,,,,
Robert Rantanen,0,,,,,,,P,,,P,,,P,P,,,,
Andy Riley,,,,,,,,,,,,,,,,,,,
Brett Riley,46 (54),,,,,,,8,,,12,10,,12,12,,,,
Basil Rowell,0,,,,,P,P,P,,,P,,,P,P,,,,
Stephen Scudder,0,,P,,P,,P,P,P,P,P,P,P,P,P,,,,P
John Searing,,,,,,,,,,,,,,,,,,,
Steven Shapiro,0,,P,,,,,P,,,P,,,P,P,,,,
Steven Short,0,,,,,,P,,,,,,,,,,,,P
Dwight Starks,0,,P,,P,,P,P,,P,P,,P,P,P,P,P,,
Joseph Verdirame,0,P,P,,P,P,P,,,,P,P,P,P,P,,,P,
Rick Webb,0,,,,P,,P,,P,,,,,,,,P,P,P
Gregg Weber,0,P,P,,,P,P,P,,,P,P,,P,P,P,,,
Tim Westfall,0,,,,,P,,P,,,P,,,,P,,,,
Robert Whitaker,85,,,,P,P,P,,,P,,12,8,10,,20,20,,15
John Wills,0,,P,P,,,,P,,,P,P,,P,P,P,,,
Matthew Zentz,0,P,P,P,P,P,P,P,P,P,P,P,P,P,P,,,,
,,,,,,,,,,,,,,,,,,,
Masters Women,Total,DS 15 Miler,Heart 10 Miler,Colonial Half,Queens Lake 5K,Yorktown 10K,DOG 5K,Heroes 4 Miler,Freedom 8K,Quest 5K,Scholarship 5K,Strider Mile,Democracy 10K,ERR 10K,XC Classic 5K,Yorktown 10 Miler,Piankatank 5K,Haiti 5K,Sleighbell 5K
Jessica Anderson,107 (134),,,,20,,15,,20,15,,,12,12,,,,20,20
Nancy Atlee,0,,,,,,P,,,,,,,,,,,,
Barbara Biasi,0,,,,,,,,P,,,,,,,,P,P,
Gail Biermann,0,,P,P,,,,,,,P,,P,P,P,P,,,
Betty Brothers,24,8,,,,P,,,,,8,8,,P,P,,,,
Jami Callahan-Brill,15,,15,,,,,,,,,,,,,,,,
Kristi Chiles,30,,8,P,12,P,,P,P,,P,10,,P,P,,,P,
Tammi Clarke,15,,,,,,,,,,,,,P,,,15,,
Carla Cline,0,,,P,,,,,,,P,,,P,,,,,
Amanda Collier,0,P,P,P,,P,,,P,,,,,,,P,,P,
Jennifer Cornette,50,,,,,12,,8,,,10,,,,8,,,12,
Susan Davis,0,,,,,,,,,,,,,P,,,,,
Virginia Davis,0,,,,,,,P,,,P,,,P,P,,,,
Kelly Doolan,,,,,,,,,,,,,,,,,,,
Jessica Epps,16,,P,P,8,,P,,P,8,P,P,P,P,P,P,,P,P
Victoria Estes,0,,,,,P,,P,,,,,,,,,,,
Marjorie Friedrichs,60,,,,,,P,,,20,,,20,20,,,,,
Thea Ganoe,0,,P,P,,P,,,P,,,,,P,,,P,,
Martha Gullo,0,,,,,P,P,,P,,,,P,P,,,,P,
Susan Hagel,81 (111),,,,P,10,10,12,10,,,12,,,12,10,20,15,
Kimberly Hague,,,,,,,,,,,,,,,,,,,
Carol Hansen-Vessa,26,,P,P,10,,P,,,P,,,P,,,P,,8,8
Julie Hicks,100 (132),15,,15,,,,20,15,,15,20,10,10,,12,,,
Michelle Hooper,8,,,,,P,P,P,P,P,P,,P,P,P,P,8,,P
Criztina Jean,0,,,,,P,P,,P,P,,,P,P,,P,P,P,P
Christina Johnsen,0,,,,,,,P,,,P,P,,P,P,,,,
Kerry Johnson,12,,,12,,,,,,,,,,,,,,,
Valor Foy Jones,52 (88),,12,8,,P,8,,8,,,,P,P,,P,12,10,10
Kirsten Kelly,115 (142),12,20,20,,,,,,,20,,15,15,20,20,,,
Susan Kreider,77 (87),10,,10,,,,10,12,,P,,,P,15,15,,,15
Anna MacLeod,0,,,,,,,,,,,,,P,,,,,
Teresa Markley,0,,,,,,P,P,,P,P,P,,,,,,,
Barbara Mathewson,,,,,,,,,,,,,,,,,,,
Bunny May,0,,,,,,,P,P,,,,P,P,,,P,,P
Connie McKeon,0,,,,,,,,P,,P,P,,P,P,P,,,
Renee Merchant,20,,,,,,20,,,,,,,,,,,,
Michelle Moore,0,,,,,,,,,,,,,P,,,,,
Jenny Moran,40,20,,,,20,,,,,,,,,,,,,
Daphne Papaefthimiou,24,,,,,,12,,,,,,,,,,,,12
Maria Peters,20,P,,,,P,,,,10,,,,P,,P,10,,
Jean Phelan,25,,10,P,15,P,P,P,P,,P,,,P,P,,,P,P
Norma Phillips,0,,,,,,,,,,,,,P,,,,,
Marie Price,0,,P,,P,P,P,P,P,P,P,P,P,P,P,,P,P,
Wendy Rafferty,69 (95),,,,,15,,15,,12,12,15,8,8,10,,,,
Rhonda Russell,,,,,,,,,,,,,,,,,,,
Kelly Russo,0,,,,,,,,,,,,,P,,,,,
Christine Schaffner,16,,P,,,8,,,,,,,,,,8,,,
Karen Schenck,0,,,,,,P,,,,P,,,,,,,,
Lori Sherwood,0,,P,,,,P,,P,,P,P,,P,P,,,,
Susan Snead,,,,,,,,,,,,,,,,,,,
Debra Sommer,0,,,,,,,,,,P,,,P,P,,,,
Jennifer St. Martin,,,,,,,,,,,,,,,,,,,
Shirley Stephens,0,,,,P,P,P,,P,P,P,,P,,,,P,P,P
Patricia Travis,0,,P,P,P,,P,,P,P,,,P,P,,P,,P,P
Elise Walton,0,P,,,,,,P,,,P,P,,P,P,,,,
Christine Williams,0,,,,,,,,P,P,,,P,,,,,,P
Helen Worthington,0,,,,,,,,P,,,,,,,,P,P,
,,,,,,,,,,,,,,,,,,,
Age Groups:,,,,,,,,,,,,,,,,,,,
,,,,,,,,,,,,,,,,,,,
Men 19 and under,Total,DS 15 Miler,Heart 10 Miler,Colonial Half,Queens Lake 5K,Yorktown 10K,DOG 5K,Heroes 4 Miler,Freedom 8K,Quest 5K,Scholarship 5K,Strider Mile,Democracy 10K,ERR 10K,XC Classic 5K,Yorktown 10 Miler,Piankatank 5K,Haiti 5K,Sleighbell 5K
Magnus Chiles,30,,,,,,,10,,,,,,,20,,,,
Glenn Glass,,,,,,,,,,,,,,,,,,,
Isaac Lamprecht,60,,,,20,,20,,,,,,20,,,,,,
Braxton Lee,230 (260),20,20,20,,20,,15,20,20,15,20,15,15,,20,,20,20
Bryton Lee,81,,,,,,,12,15,,12,15,12,,,,,15,
Yosif Rowell,60,,,,,,,20,,,20,,,20,,,,,
Lorenzo Short,15,,,,,,15,,,,,,,,,,,,
,,,,,,,,,,,,,,,,,,,
Men 20-24,,,,,,,,,,,,,,,,,,,
John Chiles,180,,20,,20,,,20,20,,20,20,,20,20,,,20,
Evan Clary,,,,,,,,,,,,,,,,,,,
,,,,,,,,,,,,,,,,,,,
Men 25-29,,,,,,,,,,,,,,,,,,,
Dillon Britt,20,,,,,,,,,,,,,20,,,,,
Matt McCombs,95,,,,,20,,,,,20,20,,15,,20,,,
Logan St. John,,,,,,,,,,,,,,,,,,,
,,,,,,,,,,,,,,,,,,,
Men 30-34,,,,,,,,,,,,,,,,,,,
Kyle Carlson,55,20,,,,,,,,,,20,,15,,,,,
Roger Hopper,220,,20,20,,20,20,20,20,20,20,,20,20,,20,,,
Benjamin Kaurich,71,,,12,20,12,15,,,,,,12,,,,,,
Jonathan Torres,95,,,15,,15,,,,15,,,15,,,15,,,20
,,,,,,,,,,,,,,,,,,,
Men 35-39,Total,DS 15 Miler,Heart 10 Miler,Colonial Half,Queens Lake 5K,Yorktown 10K,DOG 5K,Heroes 4 Miler,Freedom 8K,Quest 5K,Scholarship 5K,Strider Mile,Democracy 10K,ERR 10K,XC Classic 5K,Yorktown 10 Miler,Piankatank 5K,Haiti 5K,Sleighbell 5K
Forest Braden,20,,,,,,,,,,,,,,,20,,,
Christopher Davis,,,,,,,,,,,,,,,,,,,
Ryan Doupe,,,,,,,,,,,,,,,,,,,
Chris Free,80,,,,,,,,,,20,20,,20,20,,,,
Frank Nixon,,,,,,,,,,,,,,,,,,,
Alexey Popov,174,,,,20,20,20,10,,15,10,12,20,12,15,,20,,
Daniel Shean,20,,20,,,,,,,,,,,,,,,,
Jordan Spector,90,,15,,,,,20,20,20,15,,,,,,,,
Michael Stallings,,,,,,,,,,,,,,,,,,,
Dean Stover,77,20,,,,,,15,,,12,15,,15,,,,,
Jonathan Thornberry,12,,,,,,,12,,,,,,,,,,,
,,,,,,,,,,,,,,,,,,,
Men 40-44,,,,,,,,,,,,,,,,,,,
John Epps,180,,12,15,20,,15,15,20,12,,,12,12,,15,20,12,
Adam Kenyon,20,,20,,,,,,,,,,,,,,,,
Tobin McMurdie,145,15,,,,,,,,15,15,15,15,,15,20,,15,20
Chris Novakoski,210,20,15,20,,20,,20,,20,20,20,,15,20,,,20,
Adam Otstot,60,,,,,,20,,,,,,20,20,,,,,
Andy Riley,,,,,,,,,,,,,,,,,,,
,,,,,,,,,,,,,,,,,,,
Men 45-49,,,,,,,,,,,,,,,,,,,
Andrea Buoso,142,20,,12,15,15,,20,,20,20,,20,,,,,,
Scott Fredrick,180 (201),15,15,8,12,12,,12,15,,12,15,15,,15,20,20,15,
Chris Laws,55,,20,15,,,,,,,,,,,,,,20,
Greg Lynn,85,,,10,20,20,15,,20,,,,,,,,,,
Jason Miller,40,,,20,,,20,,,,,,,,,,,,
Brett Riley,90,,,,,,,15,,,15,20,,20,20,,,,
Steven Short,32,,,,,,12,,,,,,,,,,,,20
,,,,,,,,,,,,,,,,,,,
Men 50-54,Total,DS 15 Miler,Heart 10 Miler,Colonial Half,Queens Lake 5K,Yorktown 10K,DOG 5K,Heroes 4 Miler,Freedom 8K,Quest 5K,Scholarship 5K,Strider Mile,Democracy 10K,ERR 10K,XC Classic 5K,Yorktown 10 Miler,Piankatank 5K,Haiti 5K,Sleighbell 5K
David Anderson,136,,,12,15,,15,,15,15,,,12,20,,,,20,12
Leif Berner,18,,,P,,,,,,,,,8,10,,,,,
Joe Calkins,105,,,15,20,,20,,,20,,,15,,,,,,15
Brian Chiles,,,,,,,,,,,,,,,,,,,
David Glass,20,,,,10,,,,,,,,,,,,,,10
Thomas Hicks,160,20,,20,,20,,20,20,,,20,20,,,,,,20
Charles Inman,,,,,,,,,,,,,,,,,,,
Avinash Kelley,66,10,,10,,,,12,,,12,10,,12,,,,,
David Lockard,15,,,,,,,,,,,,,,,,,15,
James Martin,15,,,,,,,,,,15,,,,,,,,
Grant Neely,0,,,P,,,,,,,,,,,,,,,
Kevin Rafferty,137,15,,,,15,,15,,12,20,15,10,15,20,,,,
John Searing,,,,,,,,,,,,,,,,,,,
Matthew Zentz,145 (153),12,20,8,12,12,12,10,12,10,10,12,P,8,15,,,,
,,,,,,,,,,,,,,,,,,,
Men 55-59,,,,,,,,,,,,,,,,,,,
Joe Buck,168,10,15,15,12,,P,12,20,,15,,15,12,12,,,15,15
Greg Dawson,,,,,,,,,,,,,,,,,,,
Mark Doolan,,,,,,,,,,,,,,,,,,,
Robert Jean,139,,,,15,12,10,,15,15,,,12,10,,10,20,20,
Steven Kast,60,,,,20,,20,,,,,,,,,20,,,
Ken Kieft,130,15,,,,15,,15,,,20,15,,15,20,15,,,
Jon Leiding,132,20,,,,,12,20,,20,,20,20,20,,,,,
John Markley,0,,,,,,,P,,,,,,,,,,,
Paul Pelletier,75,,,20,,20,15,,,,,,,,,,,,20
Steven Peters,16,,,,,P,P,,,,8,,,P,,8,,,
Basil Rowell,44,,,,,8,8,8,,,10,,,P,10,,,,
Gregg Weber,111,12,20,,,10,P,10,,,12,12,,8,15,12,,,
,,,,,,,,,,,,,,,,,,,
Men 60-64,Total,DS 15 Miler,Heart 10 Miler,Colonial Half,Queens Lake 5K,Yorktown 10K,DOG 5K,Heroes 4 Miler,Freedom 8K,Quest 5K,Scholarship 5K,Strider Mile,Democracy 10K,ERR 10K,XC Classic 5K,Yorktown 10 Miler,Piankatank 5K,Haiti 5K,Sleighbell 5K
Ken Alberg,54,,,,,,,15,,12,,,12,P,,,,,15
Tony Heimer,105,20,12,15,10,,10,8,12,P,P,,P,8,P,10,,,
Timothy Hodge,147 (155),,,,12,8,12,,15,10,12,15,10,12,10,,12,15,12
Steve Olson,57,15,,,,P,,,,,15,,,,15,12,,,
Wayne Phelps,190,,20,,,15,,20,,15,20,,15,15,20,15,15,20,
Bill Price,163 (187),,15,20,15,12,15,12,20,8,10,12,8,10,8,,10,12,
Dwight Starks,42,,10,,8,,8,P,,P,P,,P,P,P,8,8,,
Rick Webb,30,,,,P,,P,,10,,,,,,,,P,10,10
Tim Westfall,40,,,,,10,,10,,,8,,,,12,,,,
Robert Whitaker,200,,,,20,20,20,,,20,,20,20,20,,20,20,,20
,,,,,,,,,,,,,,,,,,,
Men 65-69,,,,,,,,,,,,,,,,,,,
Gene Bachman,40,,,,,,,15,,,10,,,15,,,,,